{"text_format":"1","workbook":"xlsx","n_sheets":6,"sheets":["COVER","Table 1","Table 2","Table 3","Table 4","Labels"],"not_rendered":{"charts":0,"images":19,"macros":1,"external_links":0,"defined_names":1,"comments":1,"pivot_tables":0},"unopened":[],"bounds":{"document_bytes":16777216,"sheet_cells":100000,"rows_first":2000,"rows_last":500,"rows_between":2000,"halvings":0,"cell_chars":16384,"cell_head_chars":4096},"cells_cut":0,"cells_raw":0,"read":"whole","date_system":"1900"}

{"sheet":"COVER","index":0,"n_rows":42,"n_cols":10,"rows_kept":42,"cut":false,"hidden":false,"merged":[[41,3,41,9],[36,9,37,10],[36,11,37,13],[6,2,6,11],[8,5,8,8],[9,5,9,8],[10,5,10,8],[12,3,21,9]]}
[]
[]
[null,null,null,null,null,null,null,"Algemene Directie Energie"]
[null,null,null,null,null,null,null,"Dienst Energiemonitoring & Elektriciteitssysteem"]
[]
[]
[null,null,"Maandelijkse vragenlijst Vaste fossiele brandstoffen"]
[]
[null,null,null,"Aangever   ",null,"Naam"]
[null,null,null,"BTW-nummer   ",null,"BE0123456789"]
[null,null,null,"Periode   ",null,"01 2020"]
[]
[null,null,null,"Deze vragenlijst is opgesteld conform het Koninklijk Besluit van 22 juli 2018 houdende de organisatie van de inzameling van de gegevens nodig voor het opstellen van de steenkolenbalans.\n\nDe gevraagde gegevens moeten bezorgd worden aan de Algemene Directie Energie, uiterlijk tegen de laatste dag van de maand volgend op de maand van rapportering.\n\nHet niet naleven van artikel 5, 6, 7 en 8 van bovenvernoemd Koninklijk Besluit kan resulteren in een geldboete van 1,24 euro tot 495,79 euro.\n\nAan de aangevers wordt de verzekering gegeven, dat de verstrekte gegevens niet voor fiscale doeleinden zullen worden gebruikt\n\nE-mail : petrol.stats@economie.fgov.be"]
[]
[]
[]
[]
[]
[]
[]
[]
[]
[]
[]
[]
[]
[]
[]
[]
[]
[]
[]
[]
[]
[]
[]
[null,null,null,null,null,null,null,null,null,"Samenstelling \nmix:"]
[]
[]
[]
[]
[null,null,null,"Opmerking: De FOD Economie verwerkt uw persoonsgegevens die op dit formulier worden verzameld in overeenstemming met de Europese Verordening 2016/679 van het Europees Parlement en de Raad van 27 april 2016 betreffende de bescherming van natuurlijke personen in verband met de verwerking van persoonsgegevens en betreffende het vrije verkeer van die gegevens (GDPR). De FOD Economie verwerkt niet meer gegevens dan strikt noodzakelijk is. \nU hebt een aantal rechten met betrekking tot de persoonsgegevens die de FOD Economie gebruikt: recht op inzage, rectificatie, verzet en wissing. Om uw rechten uit te oefenen of als u vragen hebt over de verwerking van uw gegevens, kunt u contact opnemen met onze functionaris voor gegevensbescherming via e-mail op dpo@economie.fgov.be of per post op het volgende adres: Federale Overheidsdienst Economie, K.M.O., Middenstand en Energie, Data Protection Officer – Bureau van de Voorzitter, Vooruitgangstraat 50, 1210 Brussel."]

{"sheet":"Table 1","index":1,"n_rows":50,"n_cols":18,"rows_kept":50,"cut":false,"hidden":false,"merged":[[0,0,1,1],[19,0,20,1],[35,0,36,1]]}
["Balans vaste fossiele brandstoffen"]
[]
[null,null,"Antraciet","Cokeskool","Andere bitumineuze Kool","Subbitumineuze Kool","Bruinkool","Hoogovenkooks","Andere kooks","Kooks van bruinkool","Petroleumcoke","Agglomeraten","Bruinkool-\nbriketten","Schalie en oliezanden","Turf","Turfproducten ","Teer","Mix"]
["+","Beginvoorraad"]
["+","Productie"]
["+","Recuperatie"]
["+","Invoer"]
["-","Uitvoer"]
["+","Aankopen binnenlandse markt *"]
["-","Leveringen binnenlandse markt",{"$f":"SUM(C11:C12)","v":0},{"$f":"SUM(D11:D12)","v":0},0,0,0,0,0,0,0,0,0,0,0,0,{"$f":"SUM(Q11:Q12)","v":0},0]
[null,"Leveringen aan aangevers *"]
[null,"Leveringen aan eindverbruikers"]
["-","Transformatie"]
["+","Productoverdracht"]
["-","Verliezen"]
["-","Eindvoorraad"]
["=","Statistisch verschil",{"$f":"SUM(C4:C7,C9,C14)-SUM(C8,C10,C13,C15:C16)","v":0},{"$f":"SUM(D4:D7,D9,D14)-SUM(D8,D10,D15:D16)","v":0},0,0,0,0,0,0,0,0,0,0,0,0,{"$f":"SUM(Q4:Q7,Q9,Q14)-SUM(Q8,Q10,Q15:Q16)","v":0},0]
[null,null,{"$f":"IF((C7+C8+C9+C10)>0,IF((C7+C9)>(C8+C10),IF(ABS(C17)/(C7+C9)>0.1,\"Error\",\"\"),IF(ABS(C17)/(C8+C10)>0.1,\"Error\",\"\")),\"\")","v":""},"",{"$f":"IF((E7+E8+E9+E10)>0,IF((E7+E9)>(E8+E10),IF(ABS(E17)/(E7+E9)>0.1,\"Error\",\"\"),IF(ABS(E17)/(E8+E10)>0.1,\"Error\",\"\")),\"\")","v":""},{"$f":"IF((F7+F8+F9+F10)>0,IF((F7+F9)>(F8+F10),IF(ABS(F17)/(F7+F9)>0.1,\"Error\",\"\"),IF(ABS(F17)/(F8+F10)>0.1,\"Error\",\"\")),\"\")","v":""},"","","","","","","","","","","",""]
[null,"* Te specifiëren"]
["Aankopen binnenlandse markt"]
[]
[null,"Bedrijf","Antraciet","Cokeskool","Andere bitumineuze Kool","Subbitumineuze Kool","Bruinkool","Hoogovenkooks","Andere kooks","Kooks van bruinkool","Petroleumcoke","Agglomeraten","Bruinkool-\nbriketten","Schalie en oliezanden","Turf","Turfproducten ","Teer","Mix"]
[]
[]
[]
[]
[]
[]
[]
[]
[]
[]
[null,null,{"$f":"SUM(C23:C32)","v":0},{"$f":"SUM(D23:D32)","v":0},0,0,0,0,0,0,0,0,0,0,0,0,{"$f":"SUM(Q23:Q32)","v":0},0]
[null,null,{"$f":"IF(OR(C33<0.99*C9,C33>1.01*C9),\"Error\",\"\")","v":""},{"$f":"IF(OR(D33<0.99*D9,D33>1.01*D9),\"Error\",\"\")","v":""},"","","","","","","","","","","","","",""]
[]
["Leveringen aan aangevers"]
[]
[null,"Bedrijf","Antraciet","Cokeskool","Andere bitumineuze Kool","Subbitumineuze Kool","Bruinkool","Hoogovenkooks","Andere kooks","Kooks van bruinkool","Petroleumcoke","Agglomeraten","Bruinkool-\nbriketten","Schalie en oliezanden","Turf","Turfproducten ","Teer","Mix"]
[]
[]
[]
[]
[]
[]
[]
[]
[]
[]
[null,null,{"$f":"SUM(C39:C48)","v":0},{"$f":"SUM(D39:D48)","v":0},{"$f":"SUM(E39:E48)","v":0},{"$f":"SUM(F39:F48)","v":0},{"$f":"SUM(G39:G48)","v":0},{"$f":"SUM(H39:H48)","v":0},{"$f":"SUM(I39:I48)","v":0},{"$f":"SUM(J39:J48)","v":0},{"$f":"SUM(K39:K48)","v":0},{"$f":"SUM(L39:L48)","v":0},{"$f":"SUM(M39:M48)","v":0},{"$f":"SUM(N39:N48)","v":0},{"$f":"SUM(O39:O48)","v":0},{"$f":"SUM(P39:P48)","v":0},{"$f":"SUM(Q39:Q48)","v":0},0]
[null,null,{"$f":"IF(OR(C49<0.99*C11,C49>1.01*C11),\"Error\",\"\")","v":""},{"$f":"IF(OR(D49<0.99*D11,D49>1.01*D11),\"Error\",\"\")","v":""},"","","","","","","","","","","","","",""]

{"sheet":"Table 2","index":2,"n_rows":25,"n_cols":18,"rows_kept":25,"cut":false,"hidden":false,"merged":[[0,0,1,1]]}
["Leveringen per economische sector"]
[]
[null,null,"Antraciet","Cokeskool","Andere bitumineuze Kool","Subbitumineuze Kool","Bruinkool","Hoogovenkooks","Andere kooks","Kooks van bruinkool","Petroleumcoke","Agglomeraten","Bruinkool-\nbriketten","Schalie en oliezanden","Turf","Turfproducten ","Teer","Mix"]
[null,"INDUSTRIE",{"$f":"SUM(C5:C17)","v":0},{"$f":"SUM(D5:D17)","v":0},0,0,0,0,0,0,0,0,0,0,0,0,0,0]
[null,"Metaalnijverheid"]
[null,"Chemie en petrochemie"]
[null,"Non-ferro metalen"]
[null,"Mineraalhoudende industrie \n(niet-metalen)"]
[null,"Extractieve industrie"]
[null,"Machines"]
[null,"Transportmaterieel"]
[null,"Voeding, drank en tabak"]
[null,"Papier en drukkerijen"]
[null,"Houtnijverheid"]
[null,"Bouw"]
[null,"Textiel en leder"]
[null,"Niet-gespecifieerd Industrie"]
[null,"HUISHOUDELIJK EN GELIJKGESTELD",{"$f":"SUM(C19:C22)","v":0},{"$f":"SUM(D19:D22)","v":0},0,0,0,0,0,0,0,0,0,0,0,0,0,0]
[null,"Commerciële en publieke diensten"]
[null,"Residentieel / huishoudelijk"]
[null,"Landbouw, veeteelt, tuinbouw"]
[null,"Niet-gespecifieerd Huishoudelijk"]
[null,"SECTOR ONBEPAALD"]
[null,"TOTAAL",{"$f":"C4+C18+C23","v":0},{"$f":"D4+D18+D23","v":0},0,0,0,0,0,0,0,0,0,0,0,0,0,0]
[null,null,{"$f":"IF(OR(C24<0.99*'Table 1'!C12,'Table 2'!C24>1.01*'Table 1'!C12),\"Error\",\"\")","v":""},{"$f":"IF(OR(D24<0.99*'Table 1'!D12,'Table 2'!D24>1.01*'Table 1'!D12),\"Error\",\"\")","v":""},{"$f":"IF(OR(E24<0.99*'Table 1'!E12,'Table 2'!E24>1.01*'Table 1'!E12),\"Error\",\"\")","v":""},{"$f":"IF(OR(F24<0.99*'Table 1'!F12,'Table 2'!F24>1.01*'Table 1'!F12),\"Error\",\"\")","v":""},{"$f":"IF(OR(G24<0.99*'Table 1'!G12,'Table 2'!G24>1.01*'Table 1'!G12),\"Error\",\"\")","v":""},{"$f":"IF(OR(H24<0.99*'Table 1'!H12,'Table 2'!H24>1.01*'Table 1'!H12),\"Error\",\"\")","v":""},{"$f":"IF(OR(I24<0.99*'Table 1'!I12,'Table 2'!I24>1.01*'Table 1'!I12),\"Error\",\"\")","v":""},{"$f":"IF(OR(J24<0.99*'Table 1'!J12,'Table 2'!J24>1.01*'Table 1'!J12),\"Error\",\"\")","v":""},{"$f":"IF(OR(K24<0.99*'Table 1'!K12,'Table 2'!K24>1.01*'Table 1'!K12),\"Error\",\"\")","v":""},{"$f":"IF(OR(L24<0.99*'Table 1'!L12,'Table 2'!L24>1.01*'Table 1'!L12),\"Error\",\"\")","v":""},{"$f":"IF(OR(M24<0.99*'Table 1'!M12,'Table 2'!M24>1.01*'Table 1'!M12),\"Error\",\"\")","v":""},{"$f":"IF(OR(N24<0.99*'Table 1'!N12,'Table 2'!N24>1.01*'Table 1'!N12),\"Error\",\"\")","v":""},{"$f":"IF(OR(O24<0.99*'Table 1'!O12,'Table 2'!O24>1.01*'Table 1'!O12),\"Error\",\"\")","v":""},{"$f":"IF(OR(P24<0.99*'Table 1'!P12,'Table 2'!P24>1.01*'Table 1'!P12),\"Error\",\"\")","v":""},{"$f":"IF(OR(Q24<0.99*'Table 1'!Q12,'Table 2'!Q24>1.01*'Table 1'!Q12),\"Error\",\"\")","v":""},{"$f":"IF(OR(R24<0.99*'Table 1'!R12,'Table 2'!R24>1.01*'Table 1'!R12),\"Error\",\"\")","v":""}]

{"sheet":"Table 3","index":3,"n_rows":47,"n_cols":18,"rows_kept":47,"cut":false,"hidden":false,"merged":[[0,0,1,1]]}
["Invoer per land van oorsprong"]
[]
[null,null,"Antraciet","Cokeskool","Andere bitumineuze Kool","Subbitumineuze Kool","Bruinkool","Hoogovenkooks","Andere kooks","Kooks van bruinkool","Petroleumcoke","Agglomeraten","Bruinkool-\nbriketten","Schalie en oliezanden","Turf","Turfproducten ","Teer","Mix"]
[null,"Australië"]
[null,"Oostenrijk"]
[null,"Bulgarije"]
[null,"Canada"]
[null,"Colombië"]
[null,"Kroatië"]
[null,"Cyprus"]
[null,"Tsjechië"]
[null,"Denemarken"]
[null,"Estland"]
[null,"Finland"]
[null,"Frankrijk"]
[null,"Duitsland"]
[null,"Griekenland"]
[null,"Hongarije"]
[null,"Ierland"]
[null,"Italië"]
[null,"Letland"]
[null,"Litouwen"]
[null,"Luxemburg"]
[null,"Malta"]
[null,"Nederland"]
[null,"Andere Afrika"]
[null,"Andere Azië Oceanië"]
[null,"Andere Europa"]
[null,"Andere Voormalige Sovjet-Unie"]
[null,"Andere Nabije en Midden Oosten"]
[null,"Andere niet-OESO landen"]
[null,"Polen"]
[null,"Portugal"]
[null,"Roemenië"]
[null,"Rusland"]
[null,"Slovakije"]
[null,"Slovenië"]
[null,"Zuid-Afrika"]
[null,"Spanje"]
[null,"Zweden"]
[null,"Zwitserland"]
[null,"Oekraïne"]
[null,"Verenigd Koninkrijk"]
[null,"Verenigde Staten"]
[null,"Nergens elders vermeld"]
[null,"TOTAAL",{"$f":"SUM(C4:C45)","v":0},{"$f":"SUM(D4:D45)","v":0},0,0,0,0,0,0,0,0,0,0,0,0,0,0]
[null,null,{"$f":"IF(OR(C46<0.99*'Table 1'!C7,'Table 3'!C46>1.01*'Table 1'!C7),\"Error\",\"\")","v":""},{"$f":"IF(OR(D46<0.99*'Table 1'!D7,'Table 3'!D46>1.01*'Table 1'!D7),\"Error\",\"\")","v":""},{"$f":"IF(OR(E46<0.99*'Table 1'!E7,'Table 3'!E46>1.01*'Table 1'!E7),\"Error\",\"\")","v":""},{"$f":"IF(OR(F46<0.99*'Table 1'!F7,'Table 3'!F46>1.01*'Table 1'!F7),\"Error\",\"\")","v":""},{"$f":"IF(OR(G46<0.99*'Table 1'!G7,'Table 3'!G46>1.01*'Table 1'!G7),\"Error\",\"\")","v":""},{"$f":"IF(OR(H46<0.99*'Table 1'!H7,'Table 3'!H46>1.01*'Table 1'!H7),\"Error\",\"\")","v":""},{"$f":"IF(OR(I46<0.99*'Table 1'!I7,'Table 3'!I46>1.01*'Table 1'!I7),\"Error\",\"\")","v":""},{"$f":"IF(OR(J46<0.99*'Table 1'!J7,'Table 3'!J46>1.01*'Table 1'!J7),\"Error\",\"\")","v":""},{"$f":"IF(OR(K46<0.99*'Table 1'!K7,'Table 3'!K46>1.01*'Table 1'!K7),\"Error\",\"\")","v":""},{"$f":"IF(OR(L46<0.99*'Table 1'!L7,'Table 3'!L46>1.01*'Table 1'!L7),\"Error\",\"\")","v":""},{"$f":"IF(OR(M46<0.99*'Table 1'!M7,'Table 3'!M46>1.01*'Table 1'!M7),\"Error\",\"\")","v":""},{"$f":"IF(OR(N46<0.99*'Table 1'!N7,'Table 3'!N46>1.01*'Table 1'!N7),\"Error\",\"\")","v":""},{"$f":"IF(OR(O46<0.99*'Table 1'!O7,'Table 3'!O46>1.01*'Table 1'!O7),\"Error\",\"\")","v":""},{"$f":"IF(OR(P46<0.99*'Table 1'!P7,'Table 3'!P46>1.01*'Table 1'!P7),\"Error\",\"\")","v":""},{"$f":"IF(OR(Q46<0.99*'Table 1'!Q7,'Table 3'!Q46>1.01*'Table 1'!Q7),\"Error\",\"\")","v":""},{"$f":"IF(OR(R46<0.99*'Table 1'!R7,'Table 3'!R46>1.01*'Table 1'!R7),\"Error\",\"\")","v":""}]

{"sheet":"Table 4","index":4,"n_rows":47,"n_cols":18,"rows_kept":47,"cut":false,"hidden":false,"merged":[[0,0,1,1]]}
["Uitvoer per land van bestemming"]
[]
[null,null,"Antraciet","Cokeskool","Andere bitumineuze Kool","Subbitumineuze Kool","Bruinkool","Hoogovenkooks","Andere kooks","Kooks van bruinkool","Petroleumcoke","Agglomeraten","Bruinkool-\nbriketten","Schalie en oliezanden","Turf","Turfproducten ","Teer","Mix"]
[null,"Australië"]
[null,"Oostenrijk"]
[null,"Bulgarije"]
[null,"Canada"]
[null,"Colombië"]
[null,"Kroatië"]
[null,"Cyprus"]
[null,"Tsjechië"]
[null,"Denemarken"]
[null,"Estland"]
[null,"Finland"]
[null,"Frankrijk"]
[null,"Duitsland"]
[null,"Griekenland"]
[null,"Hongarije"]
[null,"Ierland"]
[null,"Italië"]
[null,"Letland"]
[null,"Litouwen"]
[null,"Luxemburg"]
[null,"Malta"]
[null,"Nederland"]
[null,"Andere Afrika"]
[null,"Andere Azië Oceanië"]
[null,"Andere Europa"]
[null,"Andere Voormalige Sovjet-Unie"]
[null,"Andere Nabije en Midden Oosten"]
[null,"Andere niet-OESO landen"]
[null,"Polen"]
[null,"Portugal"]
[null,"Roemenië"]
[null,"Rusland"]
[null,"Slovakije"]
[null,"Slovenië"]
[null,"Zuid-Afrika"]
[null,"Spanje"]
[null,"Zweden"]
[null,"Zwitserland"]
[null,"Oekraïne"]
[null,"Verenigd Koninkrijk"]
[null,"Verenigde Staten"]
[null,"Nergens elders vermeld"]
[null,"TOTAAL",{"$f":"SUM(C4:C45)","v":0},{"$f":"SUM(D4:D45)","v":0},0,0,0,0,0,0,0,0,0,0,0,0,0,0]
[null,null,{"$f":"IF(OR(C46<0.99*'Table 1'!C8,'Table 4'!C46>1.01*'Table 1'!C8),\"Error\",\"\")","v":""},{"$f":"IF(OR(D46<0.99*'Table 1'!D8,'Table 4'!D46>1.01*'Table 1'!D8),\"Error\",\"\")","v":""},{"$f":"IF(OR(E46<0.99*'Table 1'!E8,'Table 4'!E46>1.01*'Table 1'!E8),\"Error\",\"\")","v":""},{"$f":"IF(OR(F46<0.99*'Table 1'!F8,'Table 4'!F46>1.01*'Table 1'!F8),\"Error\",\"\")","v":""},{"$f":"IF(OR(G46<0.99*'Table 1'!G8,'Table 4'!G46>1.01*'Table 1'!G8),\"Error\",\"\")","v":""},{"$f":"IF(OR(H46<0.99*'Table 1'!H8,'Table 4'!H46>1.01*'Table 1'!H8),\"Error\",\"\")","v":""},{"$f":"IF(OR(I46<0.99*'Table 1'!I8,'Table 4'!I46>1.01*'Table 1'!I8),\"Error\",\"\")","v":""},{"$f":"IF(OR(J46<0.99*'Table 1'!J8,'Table 4'!J46>1.01*'Table 1'!J8),\"Error\",\"\")","v":""},{"$f":"IF(OR(K46<0.99*'Table 1'!K8,'Table 4'!K46>1.01*'Table 1'!K8),\"Error\",\"\")","v":""},{"$f":"IF(OR(L46<0.99*'Table 1'!L8,'Table 4'!L46>1.01*'Table 1'!L8),\"Error\",\"\")","v":""},{"$f":"IF(OR(M46<0.99*'Table 1'!M8,'Table 4'!M46>1.01*'Table 1'!M8),\"Error\",\"\")","v":""},{"$f":"IF(OR(N46<0.99*'Table 1'!N8,'Table 4'!N46>1.01*'Table 1'!N8),\"Error\",\"\")","v":""},{"$f":"IF(OR(O46<0.99*'Table 1'!O8,'Table 4'!O46>1.01*'Table 1'!O8),\"Error\",\"\")","v":""},{"$f":"IF(OR(P46<0.99*'Table 1'!P8,'Table 4'!P46>1.01*'Table 1'!P8),\"Error\",\"\")","v":""},{"$f":"IF(OR(Q46<0.99*'Table 1'!Q8,'Table 4'!Q46>1.01*'Table 1'!Q8),\"Error\",\"\")","v":""},{"$f":"IF(OR(R46<0.99*'Table 1'!R8,'Table 4'!R46>1.01*'Table 1'!R8),\"Error\",\"\")","v":""}]

{"sheet":"Labels","index":5,"n_rows":239,"n_cols":5,"rows_kept":239,"cut":false,"hidden":true,"merged":[]}
["Active language is :"]
[null,"NL"]
[]
["Traductions / vertalingen :"]
[]
[]
[]
[]
["Sheet","Column","Row","FR label","NL label"]
["Cover","H",2,"Direction générale Energie","Algemene Directie Energie"]
["Cover","H",3,"Service Monitoring de l'Energie & Systèmes Electriques","Dienst Energiemonitoring & Elektriciteitssysteem"]
["Cover","C",7,"Questionnaire mensuel Combustibles fossiles solides","Maandelijkse vragenlijst Vaste fossiele brandstoffen"]
["Cover","D",9,"Déclarant   ","Aangever   "]
["Cover","D",10,"n° TVA   ","BTW-nummer   "]
["Cover","D",11,"Période   ","Periode   "]
["Cover","D",13,"Ce questionnaire a été établi conformément à l’Arrêté royal du 22 juillet 2018 organisant la collecte de données nécessaures à l'établissement du bilan charbonnier\n\nLes données demandées doivent être fournies à la Direction générale de l’Énergie au plus tard le 20ème jour du mois suivant celui du rapport. \n\nLe non-respect des articles 5, 6, 7 et 8 dudit Arrêté royal peut résulter en une amende allant de 1,24 euros à 495,79 euros.\n\nL’assurance est donnée aux déclarants que les informations transmises ne seront pas utilisées dans un but fiscal.\n\nAdresse e-mail : petrol.stats@economie.fgov.be\n","Deze vragenlijst is opgesteld conform het Koninklijk Besluit van 22 juli 2018 houdende de organisatie van de inzameling van de gegevens nodig voor het opstellen van de steenkolenbalans.\n\nDe gevraagde gegevens moeten bezorgd worden aan de Algemene Directie Energie, uiterlijk tegen de 20ste dag van de maand volgend op de maand van rapportering.\n\nHet niet naleven van artikel 5, 6, 7 en 8 van bovenvernoemd Koninklijk Besluit kan resulteren in een geldboete van 1,24 euro tot 495,79 euro.\n\nAan de aangevers wordt de verzekering gegeven, dat de verstrekte gegevens niet voor fiscale doeleinden zullen worden gebruikt\n\nE-mail : petrol.stats@economie.fgov.be"]
["Table 1","C",3,"Anthracite","Antraciet"]
["Table 1","D",3,"Charbon à coke","Cokeskool"]
["Table 1","E",3,"Autres charbons bitumineux","Andere bitumineuze Kool"]
["Table 1","F",3,"Charbons sous-bitumineux","Subbitumineuze Kool"]
["Table 1","G",3,"Lignite","Bruinkool"]
["Table 1","H",3,"Coke de cokerie","Hoogovenkooks"]
["Table 1","I",3,"Autres cokes","Andere kooks"]
["Table 1","J",3,"Coke de lignite","Kooks van bruinkool"]
["Table 1","K",3,"Coke de pétrole","Petroleumcoke"]
["Table 1","L",3,"Agglomérés","Agglomeraten"]
["Table 1","M",3,"Briquette de lignite","Bruinkool-\nbriketten"]
["Table 1","N",3,"Schistes et sables bitumineux","Schalie en oliezanden"]
["Table 1","O",3,"Tourbe ","Turf"]
["Table 1","P",3,"Produits de la tourbe","Turfproducten "]
["Table 1","Q",3,"Goudron","Teer"]
["Table 1","R",3,"Mix","Mix"]
["Table 1","B",4,"Stock début","Beginvoorraad"]
["Table 1","B",5,"Production","Productie"]
["Table 1","B",6,"Recuperation","Recuperatie"]
["Table 1","B",7,"Importation","Invoer"]
["Table 1","B",8,"Exportation","Uitvoer"]
["Table 1","B",9,"Achats sur le marché belge *","Aankopen binnenlandse markt *"]
["Table 1","B",10,"Livraisons sur le marché belge","Leveringen binnenlandse markt"]
["Table 1","B",11,"Livraisons à des déclarants *","Leveringen aan aangevers *"]
["Table 1","B",12,"Livraisons à la consommation ","Leveringen aan eindverbruikers"]
["Table 1","B",13,"Transfert de produits","Productoverdracht"]
["Table 1","B",14,"Pertes","Verliezen"]
["Table 1","B",15,"Stock fin","Eindvoorraad"]
["Table 1","B",16,"Différence statistique","Statistisch verschil"]
["Table 1","B",18,"* A détailler","* Te specifiëren"]
["Table 1","A",19,"Achats sur le marché belge","Aankopen binnenlandse markt"]
["Table 1","C",21,"Anthracite","Antraciet"]
["Table 1","D",21,"Charbon à coke","Cokeskool"]
["Table 1","E",21,"Autres charbons bitumineux","Andere bitumineuze Kool"]
["Table 1","F",21,"Charbons sous-bitumineux","Subbitumineuze Kool"]
["Table 1","G",21,"Lignite","Bruinkool"]
["Table 1","H",21,"Coke de cokerie","Hoogovenkooks"]
["Table 1","I",21,"Autres cokes","Andere kooks"]
["Table 1","J",21,"Coke de lignite","Kooks van bruinkool"]
["Table 1","K",21,"Coke de pétrole","Petroleumcoke"]
["Table 1","L",21,"Agglomérés","Agglomeraten"]
["Table 1","M",21,"Briquette de lignite","Bruinkool-\nbriketten"]
["Table 1","N",21,"Schistes et sables bitumineux","Schalie en oliezanden"]
["Table 1","O",21,"Tourbe ","Turf"]
["Table 1","P",21,"Produits de la tourbe","Turfproducten "]
["Table 1","Q",21,"Goudron","Teer"]
["Table 1","R",21,"Mix","Mix"]
["Table 1","B",21,"Société","Bedrijf"]
["Table 1","A",35,"Livraisons à des déclarants","Leveringen aan aangevers"]
["Table 1","C",37,"Anthracite","Antraciet"]
["Table 1","D",37,"Charbon à coke","Cokeskool"]
["Table 1","E",37,"Autres charbons bitumineux","Andere bitumineuze Kool"]
["Table 1","F",37,"Charbons sous-bitumineux","Subbitumineuze Kool"]
["Table 1","G",37,"Lignite","Bruinkool"]
["Table 1","H",37,"Coke de cokerie","Hoogovenkooks"]
["Table 1","I",37,"Autres cokes","Andere kooks"]
["Table 1","J",37,"Coke de lignite","Kooks van bruinkool"]
["Table 1","K",37,"Coke de pétrole","Petroleumcoke"]
["Table 1","L",37,"Agglomérés","Agglomeraten"]
["Table 1","M",37,"Briquette de lignite","Bruinkool-\nbriketten"]
["Table 1","N",37,"Schistes et sables bitumineux","Schalie en oliezanden"]
["Table 1","O",37,"Tourbe ","Turf"]
["Table 1","P",37,"Produits de la tourbe","Turfproducten "]
["Table 1","Q",37,"Goudron","Teer"]
["Table 1","R",37,"Mix","Mix"]
["Table 1","B",37,"Société","Bedrijf"]
["Table 1","A",1,"Balance combustibles fossiles solides","Balans vaste fossiele brandstoffen"]
["Table 2","A",1,"Livraisons par secteurs économiques","Leveringen per economische sector"]
["Table 2","B",4,"INDUSTRIE","INDUSTRIE"]
["Table 2","B",5,"Sidérurgie","Metaalnijverheid"]
["Table 2","B",6,"Chimie et pétrochimie","Chemie en petrochemie"]
["Table 2","B",7,"Métaux non ferreux","Non-ferro metalen"]
["Table 2","B",8,"Produits minéraux non métalliques","Mineraalhoudende industrie \n(niet-metalen)"]
["Table 2","B",9,"Industries extractives","Extractieve industrie"]
["Table 2","B",10,"Machines","Machines"]
["Table 2","B",11,"Matériel de transport","Transportmaterieel"]
["Table 2","B",12,"Alimentation, boisson et tabac","Voeding, drank en tabak"]
["Table 2","B",13,"Papier-imprimerie","Papier en drukkerijen"]
["Table 2","B",14,"Bois et ouvrages en bois","Houtnijverheid"]
["Table 2","B",15,"Construction","Bouw"]
["Table 2","B",16,"Textile et cuir","Textiel en leder"]
["Table 2","B",17,"Industrie Non-spécifié","Niet-gespecifieerd Industrie"]
["Table 2","B",18,"DOMESTIQUE ET EQUIVALENT","HUISHOUDELIJK EN GELIJKGESTELD"]
["Table 2","B",19,"Commerce et services publics","Commerciële en publieke diensten"]
["Table 2","B",20,"Résidentiel / domestique","Residentieel / huishoudelijk"]
["Table 2","B",21,"Agricultur, élevage, horticulture","Landbouw, veeteelt, tuinbouw"]
["Table 2","B",22,"Domestique Non-spécifié","Niet-gespecifieerd Huishoudelijk"]
["Table 2","B",23,"SECTEUR INDETERMINE","SECTOR ONBEPAALD"]
["Table 2","B",24,"TOTAL","TOTAAL"]
["Table 2","C",3,"Anthracite","Antraciet"]
["Table 2","D",3,"Charbon à coke","Cokeskool"]
["Table 2","E",3,"Autres charbons bitumineux","Andere bitumineuze Kool"]
["Table 2","F",3,"Charbons sous-bitumineux","Subbitumineuze Kool"]
["Table 2","G",3,"Lignite","Bruinkool"]
["Table 2","H",3,"Coke de cokerie","Hoogovenkooks"]
["Table 2","I",3,"Autres cokes","Andere kooks"]
["Table 2","J",3,"Coke de lignite","Kooks van bruinkool"]
["Table 2","K",3,"Coke de pétrole","Petroleumcoke"]
["Table 2","L",3,"Agglomérés","Agglomeraten"]
["Table 2","M",3,"Briquette de lignite","Bruinkool-\nbriketten"]
["Table 2","N",3,"Schistes et sables bitumineux","Schalie en oliezanden"]
["Table 2","O",3,"Tourbe ","Turf"]
["Table 2","P",3,"Produits de la tourbe","Turfproducten "]
["Table 2","Q",3,"Goudron","Teer"]
{"$rows_left_out":119}