{"text_format":"1","workbook":"xlsx","n_sheets":14,"sheets":["START","Intro","Table 1","Table 2","Table 3","Table 4","Labels","Balans - omzetting","Biodiesel","E95 - E5","E95 - E10","E98 - E5","E98 - E10","Bio-ethanol"],"not_rendered":{"charts":0,"images":4,"macros":1,"external_links":0,"defined_names":9,"comments":0,"pivot_tables":0},"unopened":[],"bounds":{"document_bytes":16777216,"sheet_cells":100000,"rows_first":2000,"rows_last":500,"rows_between":2000,"halvings":0,"cell_chars":16384,"cell_head_chars":4096},"cells_cut":0,"cells_raw":0,"read":"whole","date_system":"1900"}

{"sheet":"START","index":0,"n_rows":30,"n_cols":11,"rows_kept":30,"cut":false,"hidden":false,"merged":[[11,2,11,10],[13,2,13,12]]}
[]
[]
[]
[]
[]
[]
[]
[]
[null,"Algemene Directie Energie",null,null,null,null,null,null,null,null,"Direction Générale Energie"]
[null,"Dienst Energiemonitoring & Elektriciteitssysteem",null,null,null,null,null,null,null,null,"Service Monitoring de l'Energie & Système Electrique"]
{"$rows_left_out":21}
{"sheet":"Intro","index":1,"n_rows":110,"n_cols":6,"rows_kept":110,"cut":false,"hidden":true,"merged":[[11,4,11,5],[14,1,35,9]]}
[]
[]
[]
[]
[]
[null,"Algemene Directie Energie"]
[null,"Dienst Energiemonitoring & Elektriciteitssysteem"]
[null,"Dienst Kwaliteit van Aardolieproducten"]
[]
[]
{"$rows_left_out":101}
{"sheet":"Table 1","index":2,"n_rows":26,"n_cols":7,"rows_kept":26,"cut":false,"hidden":true,"merged":[[2,2,2,3],[9,2,10,2],[9,3,10,3],[9,4,10,4],[9,5,10,5]]}
[]
[]
[null,{"$f":"Intro!B12","v":"Aangever"},{"$f":"Intro!E12","v":"Naam/Nom"},null,null,null,"ALLE GEGEVENS MOETEN WORDEN "]
[null,{"$f":"Intro!B13","v":"Maand van aangifte"},{"$f":"Intro!E13","v":"01"},{"$f":"Intro!F13","v":2018},null,null,"INGEGEVEN IN  TON"]
[]
[]
["Table 1: BALANS RUWE OLIE, CONDENSATEN VAN AARDGAS EN INTERMEDIAIRE PRODUCTEN"]
[]
[]
[null,null,"Ruwe olie","Condensaten van aardgas","Intermediaire producten","Totaal"]
{"$rows_left_out":17}
{"sheet":"Table 2","index":3,"n_rows":28,"n_cols":37,"rows_kept":28,"cut":false,"hidden":true,"merged":[[23,12,23,13],[23,20,23,21],[23,25,23,26],[4,32,5,32],[4,33,5,33],[4,34,5,34],[4,35,5,35],[4,36,5,36],[22,12,22,13],[22,16,22,17],[22,18,22,19],[22,20,22,21],[4,18,5,18],[4,20,5,20],[4,21,5,21],[4,27,5,27],[4,30,5,30],[4,31,5,31],[4,17,5,17],[4,2,5,2],[4,6,5,6],[4,7,5,7],[4,12,5,12],[4,13,5,13]]}
[]
[null,{"$f":"IF('Table 1'!C3=0,\"\",'Table 1'!C3)","v":"Naam/Nom"}]
[null,{"$f":"IF('Table 1'!C4=0,\"\",'Table 1'!C4 & \" \" &'Table 1'!D4)","v":"01 2018"}]
["Table 2: BALANS AFGEWERKTE OLIEPRODUCTEN "]
[null,null,"Additieven /  Mengcomponent",null,null,null,"Oncondenseerbaar raffinagegas","Totaal LPG",null,null,null,null,"Nafta","Totaal motor benzine",null,null,null,"Vliegtuig- benzine","Totaal\nkerosine\ntype\njet fuel",null,"Lamp-petroleum","Totaal\ngas/diesel\nolie",null,null,null,null,null,"Zware residuele stookolie",null,null,"White spirit en Speciale benzine","Smeer-middelen","Bitumen","Paraffine","Petroleum coke","Andere olieproducten","Totaal olieproducten"]
[null,null,null,"Additief","Bio-ethanol","Biodiesel",null,null,"Butaan","Propaan","Gemengd (LPG)","Andere LPG",null,null,"Benzine 98 RON 10S","Benzine 95 RON 10S","Andere benzine",null,null,"waarvan via CEPS pijplijn",null,null,"Gasolie Diesel 10S","Gasolie verwarming","Gasolie verwarming Extra","Gasolie Rijn en binnenvaart","Andere Gasolie",null,"Laag zwavel\n(<1%)","Hoog zwavel\n (>=1%)"]
["+","Beginvoorraad ",null,null,null,null,null,{"$f":"I7+J7+K7+L7","v":0},null,null,null,null,null,{"$f":"O7+P7+Q7","v":0},null,null,null,null,null,null,null,{"$f":"W7+X7+Y7+Z7+AA7","v":0},null,null,null,null,null,{"$f":"AC7+AD7","v":0},null,null,null,null,null,null,null,null,{"$f":"H7+M7+N7+R7+S7+U7+V7+AB7+AE7+AF7+AG7+AH7+AI7+AJ7+C7","v":0}]
["+","Import",null,null,null,null,null,0,null,null,null,null,null,{"$f":"O8+P8+Q8","v":0},null,null,null,null,null,null,null,{"$f":"W8+X8+Y8+Z8+AA8","v":0},null,null,null,null,null,{"$f":"AC8+AD8","v":0},null,null,null,null,null,null,null,null,{"$f":"H8+M8+N8+R8+S8+U8+V8+AB8+AE8+AF8+AG8+AH8+AI8+AJ8+C8","v":0}]
["-","Export",null,null,null,null,null,0,null,null,null,null,null,0,null,null,null,null,null,null,null,0,null,null,null,null,null,0,null,null,null,null,null,null,null,null,{"$f":"H9+M9+N9+R9+S9+U9+V9+AB9+AE9+AF9+AG9+AH9+AI9+AJ9+C9","v":0}]
["-","Internationale bunkers",null,null,null,null,null,0,null,null,null,null,null,0,null,null,null,null,null,null,null,0,null,null,null,null,null,0,null,null,null,null,null,null,null,null,{"$f":"H10+M10+N10+R10+S10+U10+V10+AB10+AE10+AF10+AG10+AH10+AI10+AJ10+C10","v":0}]
{"$rows_left_out":19}
{"sheet":"Table 3","index":4,"n_rows":115,"n_cols":40,"rows_kept":115,"cut":false,"hidden":true,"merged":[[4,37,5,37],[4,38,5,38],[4,39,5,39],[4,29,5,29],[4,32,5,32],[4,33,5,33],[4,34,5,34],[4,35,5,35],[4,36,5,36],[4,23,5,23],[4,1,5,1],[4,2,5,2],[4,3,5,3],[4,4,5,4],[4,5,5,5],[4,9,5,9],[4,14,5,14],[4,15,5,15],[4,19,5,19],[4,20,5,20],[4,22,5,22]]}
[]
[{"$f":"IF('Table 1'!C3=0,\"\",'Table 1'!C3)","v":"Naam/Nom"}]
[{"$f":"IF('Table 1'!C4=0,\"\",'Table 1'!C4 & \" \" &'Table 1'!D4)","v":"01 2018"}]
["Table 3: IMPORT PER LAND"]
[null,"Ruwe olie","Condensaten van aardgas","Intermediaire producten","Totaal Ruwe Producten","Additieven /  Mengcomponent",null,null,null,"Totaal LPG",null,null,null,null,"Nafta","Totaal motor benzine",null,null,null,"Vliegtuig- benzine","Totaal\nkerosine\ntype\njet fuel",null,"Lamp-petroleum","Totaal\ngas/diesel\nolie",null,null,null,null,null,"Zware residuele stookolie",null,null,"White spirit en Speciale benzine","Smeer-middelen","Bitumen","Paraffine","Petroleum coke","Andere olieproducten","Totaal Producten","Totaal\nOlie"]
[null,null,null,null,null,null,"Klassiek","Bio-ethanol","Biodiesel",null,"Butaan","Propaan","Gemengd (LPG)","Andere LPG",null,null,"Benzine 98 RON 10S","Benzine 95 RON 10S","Andere benzine",null,null,"waarvan via CEPS pijplijn",null,null,"Gasolie Diesel 10S","Gasolie verwarming","Gasolie verwarming Extra","Gasolie Rijn en binnenvaart","Andere Gasolie",null,"Laag zwavel\n(<1%)","Hoog zwavel\n (>=1%)"]
["Algeria",null,null,null,{"$f":"SUM(B7:D7)","v":0},null,null,null,null,{"$f":"K7+L7+M7+N7","v":0},null,null,null,null,null,{"$f":"Q7+S7+R7","v":0},null,null,null,null,null,null,null,{"$f":"Y7+Z7+AA7+AB7+AC7","v":0},null,null,null,null,null,{"$f":"AE7+AF7","v":0},null,null,null,null,null,null,null,null,{"$f":"AL7+AK7+AJ7+AI7+AH7+AG7+AD7+X7+W7+U7+T7+P7+O7+J7+F7","v":0},{"$f":"AM7+E7","v":0}]
["Angola",null,null,null,{"$f":"SUM(B8:D8)","v":0},null,null,null,null,{"$f":"K8+L8+M8+N8","v":0},null,null,null,null,null,{"$f":"Q8+S8+R8","v":0},null,null,null,null,null,null,null,{"$f":"Y8+Z8+AA8+AB8+AC8","v":0},null,null,null,null,null,{"$f":"AE8+AF8","v":0},null,null,null,null,null,null,null,null,0,0]
["Argentina",null,null,null,0,null,null,null,null,0,null,null,null,null,null,0,null,null,null,null,null,null,null,0,null,null,null,null,null,0,null,null,null,null,null,null,null,null,0,0]
["Armenia",null,null,null,0,null,null,null,null,0,null,null,null,null,null,0,null,null,null,null,null,null,null,0,null,null,null,null,null,0,null,null,null,null,null,null,null,null,0,0]
{"$rows_left_out":106}
{"sheet":"Table 4","index":5,"n_rows":106,"n_cols":40,"rows_kept":106,"cut":false,"hidden":true,"merged":[[4,37,5,37],[4,38,5,38],[4,39,5,39],[4,29,5,29],[4,32,5,32],[4,33,5,33],[4,34,5,34],[4,35,5,35],[4,36,5,36],[4,23,5,23],[4,1,5,1],[4,2,5,2],[4,3,5,3],[4,4,5,4],[4,5,5,5],[4,9,5,9],[4,14,5,14],[4,15,5,15],[4,19,5,19],[4,20,5,20],[4,22,5,22]]}
[]
[{"$f":"IF('Table 1'!C3=0,\"\",'Table 1'!C3)","v":"Naam/Nom"}]
[{"$f":"IF('Table 1'!C4=0,\"\",'Table 1'!C4 & \" \" &'Table 1'!D4)","v":"01 2018"}]
["Table 4: EXPORT PER LAND"]
[null,"Ruwe olie","Condensaten van aardgas","Intermediaire producten","Totaal Ruwe Producten","Additieven /  Mengcomponent",null,null,null,"Totaal LPG",null,null,null,null,"Nafta","Totaal motor benzine",null,null,null,"Vliegtuig- benzine","Totaal\nkerosine\ntype\njet fuel",null,"Lamp-petroleum","Totaal\ngas/diesel\nolie",null,null,null,null,null,"Zware residuele stookolie",null,null,"White spirit en Speciale benzine","Smeer-middelen","Bitumen","Paraffine","Petroleum coke","Andere olieproducten","Totaal Producten","Totaal\nOlie"]
[null,null,null,null,null,null,"Klassiek","Bio-ethanol","Biodiesel",null,"Butaan","Propaan","Gemengd (LPG)","Andere LPG",null,null,"Benzine 98 RON 10S","Benzine 95 RON 10S","Andere benzine",null,null,"waarvan via CEPS pijplijn",null,null,"Gasolie Diesel 10S","Gasolie verwarming","Gasolie verwarming Extra","Gasolie Rijn en binnenvaart","Andere Gasolie",null,"Laag zwavel\n(<1%)","Hoog zwavel\n (>=1%)"]
["Algeria",null,null,null,{"$f":"SUM(B7:D7)","v":0},null,null,null,null,{"$f":"K7+L7+M7+N7","v":0},null,null,null,null,null,{"$f":"Q7+S7+R7","v":0},null,null,null,null,null,null,null,{"$f":"Y7+Z7+AA7+AB7+AC7","v":0},null,null,null,null,null,{"$f":"AE7+AF7","v":0},null,null,null,null,null,null,null,null,{"$f":"AL7+AK7+AJ7+AI7+AH7+AG7+AD7+X7+W7+U7+T7+P7+O7+J7+F7","v":0},{"$f":"AM7+E7","v":0}]
["Argentina",null,null,null,{"$f":"SUM(B8:D8)","v":0},null,null,null,null,{"$f":"K8+L8+M8+N8","v":0},null,null,null,null,null,{"$f":"Q8+S8+R8","v":0},null,null,null,null,null,null,null,{"$f":"Y8+Z8+AA8+AB8+AC8","v":0},null,null,null,null,null,{"$f":"AE8+AF8","v":0},null,null,null,null,null,null,null,null,0,0]
["Armenia",null,null,null,0,null,null,null,null,0,null,null,null,null,null,0,null,null,null,null,null,null,null,0,null,null,null,null,null,0,null,null,null,null,null,null,null,null,0,0]
["Australia",null,null,null,0,null,null,null,null,0,null,null,null,null,null,0,null,null,null,null,null,null,null,0,null,null,null,null,null,0,null,null,null,null,null,null,null,null,0,0]
{"$rows_left_out":97}
{"sheet":"Labels","index":6,"n_rows":602,"n_cols":5,"rows_kept":602,"cut":false,"hidden":true,"merged":[]}
["Active language is :"]
[null,"NL"]
[]
["Traductions / vertalingen :"]
[]
[]
[]
[]
["Sheet","Column","Row","FR label","NL label"]
["Intro","B",6,"Direction Générale Energie","Algemene Directie Energie"]
{"$rows_left_out":593}
{"sheet":"Balans - omzetting","index":7,"n_rows":29,"n_cols":7,"rows_kept":29,"cut":false,"hidden":true,"merged":[[3,5,4,6],[6,0,8,0],[6,1,7,3],[6,4,7,6],[28,1,28,2],[28,3,28,5]]}
[]
["Biobrandstoffen: omzetting van massa naar volume van de inverbruikgestelde hoeveelheden"]
[]
[null,"De biobalans dient per kwartaal ingevuld te worden",null,null,null,"DRIEMAANDELIJKS"]
[null,"(op de laatste werkdag van de maand volgend op het kwartaal)"]
[]
[null,"Diesel (gemengd)",null,null,"Benzine (gemengd)"]
[]
[null,"Petroleumbalans\n(ton)","Biobalans\n(m³)","Berekende massadichtheid (kg/m³)","Petroleumbalans\n(ton)","Biobalans\n(m³)","Berekende massadichtheid (kg/m³)"]
["Januari"]
{"$rows_left_out":20}
{"sheet":"Biodiesel","index":8,"n_rows":177,"n_cols":14,"rows_kept":177,"cut":false,"hidden":true,"merged":[[21,13,22,13],[106,7,106,8],[106,9,106,11],[107,6,108,6],[107,7,107,8],[107,9,107,11],[107,12,108,12],[107,13,108,13],[21,7,22,7],[21,8,22,8],[21,9,22,9],[21,10,22,10],[21,11,22,11],[21,12,22,12],[1,1,1,6],[20,3,20,5],[21,1,22,1],[21,2,22,2],[21,3,22,3],[21,4,22,4],[21,5,22,5],[21,6,22,6],[19,4,19,7]]}
[]
[null,"Bijlage I - Trimestriële balans met betrekking tot de verplichte bijmenging van biobrandstoffen in de hoeveelheden diesel die tot verbruik worden uitgeslagen"]
[]
[]
[null,"TRIMESTER VAN DE IN VERBRUIKSTELLING  (voorbeeld 2017 / Q1) :",null,null,"2017 / Q1"]
[]
[]
[null,"IDENTIFICATIE VAN DE MAATSCHAPPIJ (maatschappelijke zetel) :",null,null,"in te vullen","automatisch ingevuld"]
[]
[]
{"$rows_left_out":168}
{"sheet":"E95 - E5","index":9,"n_rows":131,"n_cols":14,"rows_kept":131,"cut":false,"hidden":true,"merged":[[66,8,66,9],[66,10,66,12],[67,8,67,9],[67,10,67,12],[67,13,68,13],[21,8,22,8],[21,9,22,9],[21,10,22,10],[21,11,22,11],[21,13,22,13],[21,12,22,12],[1,1,1,6],[20,3,20,5],[21,1,22,1],[21,2,22,2],[21,3,22,3],[21,4,22,4],[21,5,22,5],[21,6,22,6],[19,4,19,7],[21,7,22,7]]}
[]
[null,"Bijlage I - Trimestriële balans met betrekking tot de verplichte bijmenging van biobrandstoffen in de hoeveelheden benzine E95 - E5 die tot verbruik worden uitgeslagen"]
[]
[]
[null,"TRIMESTER VAN DE IN VERBRUIKSTELLING  (voorbeeld 2017 / Q1) :",null,null,{"$f":"Biodiesel!E5","v":"2017 / Q1"}]
[]
[]
[null,"IDENTIFICATIE VAN DE MAATSCHAPPIJ (maatschappelijke zetel) :",null,null,"in te vullen","automatisch ingevuld"]
[]
[]
{"$rows_left_out":122}
{"sheet":"E95 - E10","index":10,"n_rows":131,"n_cols":14,"rows_kept":131,"cut":false,"hidden":true,"merged":[[66,8,66,9],[66,10,66,12],[67,8,67,9],[67,10,67,12],[67,13,68,13],[21,8,22,8],[21,9,22,9],[21,10,22,10],[21,11,22,11],[21,13,22,13],[21,12,22,12],[1,1,1,6],[20,3,20,5],[21,1,22,1],[21,2,22,2],[21,3,22,3],[21,4,22,4],[21,5,22,5],[21,6,22,6],[19,4,19,7],[21,7,22,7]]}
[]
[null,"Bijlage I - Trimestriële balans met betrekking tot de verplichte bijmenging van biobrandstoffen in de hoeveelheden benzine E95 - E10 die tot verbruik worden uitgeslagen"]
[]
[]
[null,"TRIMESTER VAN DE IN VERBRUIKSTELLING  (voorbeeld 2017 / Q1) :",null,null,{"$f":"Biodiesel!E5","v":"2017 / Q1"}]
[]
[]
[null,"IDENTIFICATIE VAN DE MAATSCHAPPIJ (maatschappelijke zetel) :",null,null,"in te vullen","automatisch ingevuld"]
[]
[]
{"$rows_left_out":122}
{"sheet":"E98 - E5","index":11,"n_rows":131,"n_cols":14,"rows_kept":131,"cut":false,"hidden":true,"merged":[[66,8,66,9],[66,10,66,12],[67,8,67,9],[67,10,67,12],[67,13,68,13],[21,8,22,8],[21,9,22,9],[21,10,22,10],[21,11,22,11],[21,13,22,13],[21,12,22,12],[1,1,1,6],[20,3,20,5],[21,1,22,1],[21,2,22,2],[21,3,22,3],[21,4,22,4],[21,5,22,5],[21,6,22,6],[19,4,19,7],[21,7,22,7]]}
[]
[null,"Bijlage I - Trimestriële balans met betrekking tot de verplichte bijmenging van biobrandstoffen in de hoeveelheden benzine E98 - E5 die tot verbruik worden uitgeslagen"]
[]
[]
[null,"TRIMESTER VAN DE IN VERBRUIKSTELLING  (voorbeeld 2017 / Q1) :",null,null,{"$f":"Biodiesel!E5","v":"2017 / Q1"}]
[]
[]
[null,"IDENTIFICATIE VAN DE MAATSCHAPPIJ (maatschappelijke zetel) :",null,null,"in te vullen","automatisch ingevuld"]
[]
[]
{"$rows_left_out":122}
{"sheet":"E98 - E10","index":12,"n_rows":131,"n_cols":14,"rows_kept":131,"cut":false,"hidden":true,"merged":[[21,8,22,8],[21,9,22,9],[21,10,22,10],[21,11,22,11],[67,14,68,14],[21,13,22,13],[66,8,66,9],[66,10,66,12],[67,8,67,9],[67,10,67,12],[67,13,68,13],[21,12,22,12],[1,1,1,6],[20,3,20,5],[21,1,22,1],[21,2,22,2],[21,3,22,3],[21,4,22,4],[21,5,22,5],[21,6,22,6],[19,4,19,7],[21,7,22,7]]}
[]
[null,"Bijlage I - Trimestriële balans met betrekking tot de verplichte bijmenging van biobrandstoffen in de hoeveelheden benzine E98 - E10 die tot verbruik worden uitgeslagen"]
[]
[]
[null,"TRIMESTER VAN DE IN VERBRUIKSTELLING  (voorbeeld 2017 / Q1) :",null,null,{"$f":"Biodiesel!E5","v":"2017 / Q1"}]
[]
[]
[null,"IDENTIFICATIE VAN DE MAATSCHAPPIJ (maatschappelijke zetel) :",null,null,"in te vullen","automatisch ingevuld"]
[]
[]
{"$rows_left_out":122}
{"sheet":"Bio-ethanol","index":13,"n_rows":84,"n_cols":12,"rows_kept":84,"cut":false,"hidden":true,"merged":[[33,10,34,10],[33,11,34,11],[1,1,1,6],[32,5,32,6],[32,7,32,9],[33,4,34,4],[33,5,33,6],[33,7,33,9]]}
[]
[null,"Bijlage I - Trimestriële balans met betrekking tot de verplichte bijmenging van biobrandstoffen in de hoeveelheden benzine die tot verbruik worden uitgeslagen"]
[]
[]
[null,"TRIMESTER VAN DE IN VERBRUIKSTELLING  (voorbeeld 2017 / Q1) :",null,null,{"$f":"Biodiesel!E5","v":"2017 / Q1"}]
[]
[]
[null,"IDENTIFICATIE VAN DE MAATSCHAPPIJ (maatschappelijke zetel) :",null,null,"in te vullen","automatisch ingevuld"]
[]
[]
{"$rows_left_out":74}